Error Node Modules Node Sass Command Failed Exit Code 1 Command Node Scripts Build Js Node Js Information Guide

  1. Introduction on Error Node Modules Node Sass Command Failed Exit Code 1 Command Node Scripts Build Js Node Js
  2. Important Facts
  3. Recent Updates
  4. Full Guide
  5. Final Thoughts

Introduction on Error Node Modules Node Sass Command Failed Exit Code 1 Command Node Scripts Build Js Node Js

Full error node_modules/node-sass: Command failed Exit code: 1 Command: node scripts/build.js node js News
Looking for the latest information on Error Node Modules Node Sass Command Failed Exit Code 1 Command Node Scripts Build Js Node Js? We've researched comprehensive data, records, and insights about Error Node Modules Node Sass Command Failed Exit Code 1 Command Node Scripts Build Js Node Js.

Important Facts

Information NodeJS : error /node_modules/node-sass: Command failed Guide
Explore the main sources for Error Node Modules Node Sass Command Failed Exit Code 1 Command Node Scripts Build Js Node Js.

Recent Updates

Details How to Resolve the node-sass Installation Error News
Stay updated on Error Node Modules Node Sass Command Failed Exit Code 1 Command Node Scripts Build Js Node Js's latest milestones.

How to Fix 'Cannot Find Module node-sass' Error After npm install
How to Fix 'Cannot Find Module node-sass' Error After npm install
NodeJS : ERROR in ./src/styles.scss .. Module build failed: Error: Cannot find module 'node-sass'
NodeJS : ERROR in ./src/styles.scss .. Module build failed: Error: Cannot find module 'node-sass'
NodeJS : Getting errors while installing node-sass
NodeJS : Getting errors while installing node-sass
npm Error Failed at the node-sass@4.9.0 install script (2 Solutions!!)
npm Error Failed at the node-sass@4.9.0 install script (2 Solutions!!)
Cannot find module node-sass error on npm run dev
Cannot find module node-sass error on npm run dev
ERROR in Cannot find module 'node-sass' npm install node-sass node js
ERROR in Cannot find module 'node-sass' npm install node-sass node js
NodeJS : Cannot install node-sass npm module
NodeJS : Cannot install node-sass npm module
Fix Node MSBuild Exit code 1 | Workaround guide
Fix Node MSBuild Exit code 1 | Workaround guide
node-sass@4.5.1 postinstall: `node scripts/build.js`
node-sass@4.5.1 postinstall: `node scripts/build.js`
NodeJS : npm ERR! gyp ERR! when installing node sass in windows 11 with Visual Studio 2022 Enterpris
NodeJS : npm ERR! gyp ERR! when installing node sass in windows 11 with Visual Studio 2022 Enterpris
NodeJS : node-sass installation issue
NodeJS : node-sass installation issue

Full Guide

Data is compiled from public records and verified media reports.

Last Updated: October 30, 2026

Final Thoughts

Information NodeJS : Upgrading node version throws node-sass error when trying to build Guide
For 2026, Error Node Modules Node Sass Command Failed Exit Code 1 Command Node Scripts Build Js Node Js remains one of the most searched-for information profiles. Check back for the newest reports.

Disclaimer: Disclaimer: All information is compiled from publicly available data, media reports, and analysis. Actual details may vary.

Summary

Arguments: Directory: node_modules/ Learn how to resolve the 'Cannot Find amzn.to/4aLHbLD You're literally one away from a better setup — grab it now! As an Amazon Associate I earn ... Want to install something using npm, but can't because of an annoying MSBuild

Error Node Modules Node Sass Command Failed Exit Code 1 Command Node Scripts Build Js Node Js.pdf

Size: 1.51 MB · Format: PDF · Secure Download

Download PDF Read Online

Frequently Asked Questions

What is the most accurate information about Error Node Modules Node Sass Command Failed Exit Code 1 Command Node Scripts Build Js Node Js?

Our platform aggregates the most comprehensive and up-to-date insights, ensuring you get relevant details about Error Node Modules Node Sass Command Failed Exit Code 1 Command Node Scripts Build Js Node Js.

Why is Error Node Modules Node Sass Command Failed Exit Code 1 Command Node Scripts Build Js Node Js trending right now?

Interest in Error Node Modules Node Sass Command Failed Exit Code 1 Command Node Scripts Build Js Node Js has surged recently as more people seek reliable resources, related media, and detailed analysis.

Where can I find related media and updates for Error Node Modules Node Sass Command Failed Exit Code 1 Command Node Scripts Build Js Node Js?

You can explore extensive galleries, video summaries, and related content directly on this page.

How often is the content about Error Node Modules Node Sass Command Failed Exit Code 1 Command Node Scripts Build Js Node Js updated?

We regularly update our database with the latest information, media, and analysis related to Error Node Modules Node Sass Command Failed Exit Code 1 Command Node Scripts Build Js Node Js.

Related Documents

Popular Topics

Infinity Erace System Can Anyone Really Sing Golden Live Vocal Coach Analysis Json Server Tutorial Fake Rest Api 7 Basic Crud Operations Delete Requests Basketball 5 Spot Shooting L A Stop The Clocks Sub Espanol How To Write Articles With Ai Seo With Claude Gpt 4 Omni I Was Surprised By The Barbour Sizing Bedale Vs Beaufort Arizona Tops Iowa State Google Sheets Query From Another Sheet Importrange Use Multiple Tabs Subquery Examples Tutorial Defining The Gpu Computation Intro To Parallel Programming I 10 Bisect A Line Proof 100 Drake Backgrounds Wallpapers Com All She Wrote Firehouselyrics Nightcore Sad Machine Indexable Heavy Traffic Article Submission Backlink How To Create Article Submission Backlink
close