About of Execution Failed For Task Appcheckdebugduplicateclasses
Looking for the latest information on Execution Failed For Task Appcheckdebugduplicateclasses? We've researched comprehensive data, records, and insights about Execution Failed For Task Appcheckdebugduplicateclasses.
Important Facts
Explore the primary sources for Execution Failed For Task Appcheckdebugduplicateclasses.
Developments
Stay updated on Execution Failed For Task Appcheckdebugduplicateclasses's latest milestones.
Execution failed for task ':app:checkDebugDuplicateClasses || 2024
How to Fix: Execution failed for task ':app:compileDebugJavaWithJavac'
Fix Android Error Execution failed for task ':app:processDebugResources'
learn flutter, What went wrong: Execution failed for task ':app:checkDebugDuplicateClasses'.
Execution failed for task ':app:checkReleaseDuplicateClasses'
Execution failed for task ':app:checkDebugDuplicateClasses'
FAILURE: Build failed with an exception | Execution failed for task ':app:processDebugManifest' |
How to fix Execution failed for task ':app:compileDebugKotlin' | عربي
Understanding the Execution failed for task ':app:mergeExtDexDebug' Error in Android Development
Execution failed for task :flutter_plugin_android_lifecycle:compileDebugJavaWithJavac
Execution failed for task app:compileDebugKotlin in Android Studio
Deep Dive
Data is compiled from public records and verified media reports.
Last Updated: October 29, 2026
Summary
For 2026, Execution Failed For Task Appcheckdebugduplicateclasses remains one of the most searched-for information profiles. Check back for the newest reports.
Disclaimer: Disclaimer: All information is compiled from publicly available data, media reports, and analysis. Actual details may vary.
Summary
In this tutorial, we'll tackle the common Android Studio build Android studio common error when we run new Android project on Updated version so here is Error: Execution failed for task ... configurations{ all*.exclude group:'com.google.guava', module: 'listenablefuture' } ReactNative issues, How to Fix Caused by: This video is about how to Fix Android Error learn flutter and android. FAILURE: Build failed with an exception. * What went wrong: الله يسعدكم وصلوا على النبي واشتراك في القناة FAILURE: Build failed with an exception. * What went wrong: You can find the latest Kotlin version: kotlinlang.org/docs/releases.html Learn why you might encounter the " Common Causes and Solutions 1. Outdated Gradle or Flutter Plugin Version Ensure you are using the latest versions of Gradle ...
Execution Failed For Task Appcheckdebugduplicateclasses.pdf
What is the most accurate information about Execution Failed For Task Appcheckdebugduplicateclasses?
Our platform aggregates the most comprehensive and up-to-date insights, ensuring you get relevant details about Execution Failed For Task Appcheckdebugduplicateclasses.
Why is Execution Failed For Task Appcheckdebugduplicateclasses trending right now?
Interest in Execution Failed For Task Appcheckdebugduplicateclasses has surged recently as more people seek reliable resources, related media, and detailed analysis.
Where can I find related media and updates for Execution Failed For Task Appcheckdebugduplicateclasses?
You can explore extensive galleries, video summaries, and related content directly on this page.
How often is the content about Execution Failed For Task Appcheckdebugduplicateclasses updated?
We regularly update our database with the latest information, media, and analysis related to Execution Failed For Task Appcheckdebugduplicateclasses.